{"text_format":"1","workbook":"xlsx","n_sheets":9,"sheets":["Home","40-now","report1","report2","report3","report4","ทะเบียนคุมทรัพย์สิน"," Search","Sheet2"],"not_rendered":{"charts":0,"images":13,"macros":1,"external_links":0,"defined_names":5,"comments":2,"pivot_tables":4},"unopened":[],"bounds":{"document_bytes":16777216,"sheet_cells":100000,"rows_first":2000,"rows_last":500,"rows_between":2000,"halvings":0,"cell_chars":16384,"cell_head_chars":4096},"cells_cut":0,"cells_raw":0,"read":"whole","date_system":"1900"}

{"sheet":"Home","index":0,"n_rows":0,"n_cols":0,"rows_kept":0,"cut":false,"hidden":false,"merged":[[1,1,27,13]]}

{"sheet":"40-now","index":1,"n_rows":102,"n_cols":78,"rows_kept":102,"cut":false,"hidden":false,"merged":[[0,0,0,77],[1,0,1,77]]}
["มหาวิทยาลัยราชภัฏราชนครินทร์"]
["บัญชีรายการค่าเสื่อมราคาและค่าเสื่อมราคาสะสม ครุภัณฑ์ ประจำปีงบประมาณ  2559"]
[{"$f":"A2+1","v":{"$error":"#VALUE!"}}," "," "," "," "," "," "," "," "," "," ",{"$f":"CONCATENATE(BS3,\".\",BT3,\".\",BU3)","v":" . . "},{"$f":"IF(BV3=\"จำหน่าย\",0,SUM(J3*K3))","v":{"$error":"#VALUE!"}},{"$f":"IF(K3<5000,0,M3)","v":{"$error":"#VALUE!"}}," ",{"$f":"DATE(YEAR(C3)+O3,MONTH(C3),DAY(C3))","v":{"$error":"#VALUE!"}},{"$f":"IF(NOT(OR(ISBLANK(P3),ISBLANK(C3))),P3-C3,\"\")","v":{"$error":"#VALUE!"}},{"$f":"SLN(N3,,O3)","v":{"$error":"#VALUE!"}},{"$f":"SLN(R3,,12)","v":{"$error":"#VALUE!"}},{"$f":"SLN(N3,,Q3)","v":{"$error":"#VALUE!"}},{"$f":"IF(N3=0,0,IF(AE3<=Q3,1,0))","v":{"$error":"#VALUE!"}},{"$f":"SUM(R3*U3/12)","v":{"$error":"#VALUE!"}},{"$f":"IF(N3=0,0,IF((R3*AB3)+(R3*AC3/12)>=N3,N3-J3,((R3*AB3)+(R3*AC3/12))))","v":{"$error":"#VALUE!"}},{"$f":"SUM(T3*U3)","v":{"$error":"#VALUE!"}},{"$f":"IF(N3=0,0,IF((DATEDIF(C3,TODAY(),\"d\")+1)*T3>=N3,N3-J3,(DATEDIF(C3,TODAY(),\"d\")+1)*T3))","v":{"$error":"#VALUE!"}},{"$f":"IF(U3=0,0,IF(OR(DAY(C3)=1,MONTH(C3)<>MONTH(TODAY()),YEAR(C3)<>YEAR(TODAY())),T3*((DAY(DATE(YEAR(TODAY()),MONTH(TODAY())+1,1)-1))),T3*((DAY(DATE(YEAR(TODAY()),MONTH(TODAY())+1,1)-1)-DAY(C3)+1))))","v":{"$error":"#VALUE!"}},{"$f":"IF(N3=0,0,IF(X3>=N3,(J3),(N3-Y3)))","v":{"$error":"#VALUE!"}},{"$f":"DATEDIF(C3,TODAY(),\"Y\")","v":{"$error":"#VALUE!"}},{"$f":"DATEDIF(C3,TODAY(),\"YM\")","v":{"$error":"#VALUE!"}},{"$f":"DATEDIF(C3,TODAY(),\"md\")+1","v":{"$error":"#VALUE!"}},{"$f":"DATEDIF(C3,TODAY(),\"d\")+1","v":{"$error":"#VALUE!"}},{"$f":"IF(N3=0,\"No\",IF(AE3>Q3,\"NO\",\"YES\"))","v":{"$error":"#VALUE!"}}," "," "," "," "," "," "," "," "," "," "," "," "," "," "," ",{"$f":"100/O3","v":{"$error":"#VALUE!"}}," "," "," "," "," "," "," "," "," "," "," "," "," "," ",null," "," "," "," "," "," "," "," "," "," "," ",null," ",{"$f":"CONCATENATE(AB3,\" ปี  \",AC3,\" เดือน  \",AD3,\" วัน  \")","v":{"$error":"#VALUE!"}},{"$f":"A3","v":{"$error":"#VALUE!"}}]
[]
["ลำดับที่","หมายเลขเอกสาร","วันที่ได้มา","ปีงบประมาณ","วิธีการที่ได้มา","ประเภทงบประมาณ","รหัสโครงการ","บริษัท/ร้านค้า","รายการ","จำนวน","ราคาต่อหน่วย","หมายเลขครุภัณฑ์","ราคาทุนรวม","ราคาทุนที่นำมาคิดค่าเสื่อม","อายุการใช้งาน (ปี)","วันหมดอายุการใช้งาน","อายุการใช้งาน (วัน)","ค่าเสื่อมราคาต่อปี","ค่าเสื่อมราคาต่อเดือน","ค่าเสื่อมราคาต่อวัน","ระยะเวลาคิดค่าเสื่อมปี 2559","ค่าเสื่อมราคา เดือนปัจจุบัน"," ค่าเสื่อมราคาสะสม (เดือน)","ค่าเสื่อมราคา วันปัจจุบัน","ค่าเสื่อมราคาสะสม(วัน)","ค่าเสื่อมราคาเดือนปัจจุบัน (เสื่อมรายวัน)","มูลค่าสุทธิ   ","ใช้ไป (ปี)","ใช้ไป (เดือน)","ใช้ไป (วัน)","จำนวนวันทั้งหมดที่ใช้ไป","สถานะ","สมุดทะเบียนคุมเล่มที่","สมุดทะเบียนคุมหน้าที่","หน่วยงาน","สาขา","ผู้เบิก","ประเภทครุภัณฑ์","หมายเลขเครื่อง","ลักษณะ/คุณสมบัติ","รุ่น/แบบ/ขนาด","ที่อยู่ผู้ขาย","เอกสารอ้างอิง","ใบเสร็จเล่มที่","ใบเสร็จเลขที่","สัญญาเลขที่","เลขที่ใบเบิกพัสดุ","อัตราค่าเสื่อมราคา %","หมายเหตุ","ซ่อมครั้งที่","วันที่ซ่อม","รายการซ่อม","จำนวนหน่วย","จำนวนเงิน","ร้านที่รับซ่อม","หมายเหตุเอกสารอ้างอิง","ซ่อมครั้งที่","วันที่ซ่อม","รายการซ่อม","จำนวนหน่วย","จำนวนเงิน","ร้านที่รับซ่อม","หมายเหตุเอกสารอ้างอิง","ซ่อมครั้งที่","วันที่ซ่อม","รายการซ่อม","จำนวนหน่วย","จำนวนเงิน","ร้านที่รับซ่อม","หมายเหตุเอกสารอ้างอิง","หมวดครุภัณฑ์","ประเภทครุภัณฑ์","เลขครุภัณฑ์","สถานะจำหน่าย","วันที่จำหน่าย","วันที่บันทึกข้อมุล","ใช้งานไปแล้ว","ลำดับ"]
[1,null,"1997-07-31",40,null,null,null,null,"ฐานข้อมูล 1 ชุด",1,1079630,"01.61.10",{"$f":"IF(BV6=\"จำหน่าย\",0,SUM(J6*K6))","v":1079630},{"$f":"IF(K6<5000,0,M6)","v":1079630},3,{"$f":"DATE(YEAR(C6)+O6,MONTH(C6),DAY(C6))","v":"2000-07-31"},{"$f":"IF(NOT(OR(ISBLANK(P6),ISBLANK(C6))),P6-C6,\"\")","v":1096},{"$f":"SLN(N6,,O6)","v":359876.66666666669},{"$f":"SLN(R6,,12)","v":29989.722222222223},{"$f":"SLN(N6,,Q6)","v":985.06386861313865},{"$f":"IF(N6=0,0,IF(AE6<=Q6,1,0))","v":0},{"$f":"SUM(R6*U6/12)","v":0},{"$f":"IF(N6=0,0,IF((R6*AB6)+(R6*AC6/12)>=N6,N6-J6,((R6*AB6)+(R6*AC6/12))))","v":1079629},{"$f":"SUM(T6*U6)","v":0},{"$f":"IF(N6=0,0,IF((DATEDIF(C6,TODAY(),\"d\")+1)*T6>=N6,N6-J6,(DATEDIF(C6,TODAY(),\"d\")+1)*T6))","v":1079629},{"$f":"IF(U6=0,0,IF(OR(DAY(C6)=1,MONTH(C6)<>MONTH(TODAY()),YEAR(C6)<>YEAR(TODAY())),T6*((DAY(DATE(YEAR(TODAY()),MONTH(TODAY())+1,1)-1))),T6*((DAY(DATE(YEAR(TODAY()),MONTH(TODAY())+1,1)-1)-DAY(C6)+1))))","v":0},{"$f":"IF(N6=0,0,IF(X6>=N6,(J6),(N6-Y6)))","v":1},{"$f":"DATEDIF(C6,TODAY(),\"Y\")","v":21},{"$f":"DATEDIF(C6,TODAY(),\"YM\")","v":3},{"$f":"DATEDIF(C6,TODAY(),\"md\")+1","v":1},{"$f":"DATEDIF(C6,TODAY(),\"d\")+1","v":7763},{"$f":"IF(N6=0,\"No\",IF(AE6>Q6,\"NO\",\"YES\"))","v":"NO"},null,null,null,null,null,null,null,null,null,null,null,null,null,null,null,{"$f":"100/O6","v":33.333333333333336},null,null,null,null,null,null,null,null,null,null,null,null,null,null,null,null,null,null,null,null,null,null,"01","61","10",null,null,null,{"$f":"CONCATENATE(AB6,\" ปี  \",AC6,\" เดือน  \",AD6,\" วัน  \")","v":"21 ปี  3 เดือน  1 วัน  "},{"$f":"A6","v":1}]
[{"$f":"A6+1","v":2},null,"1997-09-17",40,null,null,null,null,"Software HIS PC Front office 1 ชุด",1,55000,"01.61.11",{"$f":"IF(BV7=\"จำหน่าย\",0,SUM(J7*K7))","v":55000},{"$f":"IF(K7<5000,0,M7)","v":55000},3,"2000-09-17",1096,18333.333333333332,1527.7777777777776,50.182481751824817,0,0,54999,0,54999,0,1,21,1,15,7715,"NO",null,null,null,null,null,null,null,null,null,null,null,null,null,null,null,33.333333333333336,null,null,null,null,null,null,null,null,null,null,null,null,null,null,null,null,null,null,null,null,null,null,"01","61","11",null,null,null,"21 ปี  1 เดือน  15 วัน  ",2]
[3,null,"1998-06-15",41,null,null,null,null,"Classroom Control Network 25 U 1 ชุด",1,97900,"01.61.120",{"$f":"IF(BV8=\"จำหน่าย\",0,SUM(J8*K8))","v":97900},{"$f":"IF(K8<5000,0,M8)","v":97900},3,"2001-06-15",1096,32633.333333333332,2719.4444444444443,89.324817518248182,0,0,97899,0,97899,0,1,20,4,17,7444,"NO",null,null,null,null,null,null,null,null,null,null,null,null,null,null,null,33.333333333333336,null,null,null,null,null,null,null,null,null,null,null,null,null,null,null,null,null,null,null,null,null,null,"01","61","120",null,null,null,"20 ปี  4 เดือน  17 วัน  ",3]
[4,null,"1999-05-24",42,null,null,null,null,"โปรแกรมคอมพิวเตอร์ตัดต่อภาพ 1 ชุด",1,53680,"01.61.175",{"$f":"IF(BV9=\"จำหน่าย\",0,SUM(J9*K9))","v":53680},{"$f":"IF(K9<5000,0,M9)","v":53680},3,"2002-05-24",1096,17893.333333333332,1491.1111111111111,48.978102189781019,0,0,53679,0,53679,0,1,19,5,8,7101,"NO",null,null,null,null,null,null,null,null,null,null,null,null,null,null,null,33.333333333333336,null,null,null,null,null,null,null,null,null,null,null,null,null,null,null,null,null,null,null,null,null,null,"01","61","175",null,null,null,"19 ปี  5 เดือน  8 วัน  ",4]
[5,null,"1999-09-27",42,null,null,null,null,"Upgrade UNIX 1 ชุด",1,134800,"01.61.178",{"$f":"IF(BV10=\"จำหน่าย\",0,SUM(J10*K10))","v":134800},{"$f":"IF(K10<5000,0,M10)","v":134800},3,"2002-09-27",1096,44933.333333333336,3744.4444444444448,122.99270072992701,0,0,134799,0,134799,0,1,19,1,5,6975,"NO",null,null,null,null,null,null,null,null,null,null,null,null,null,null,null,33.333333333333336,null,null,null,null,null,null,null,null,null,null,null,null,null,null,null,null,null,null,null,null,null,null,"01","61","178",null,null,null,"19 ปี  1 เดือน  5 วัน  ",5]
[6,null,"1999-09-27",42,null,null,null,null,"Upgrade Network 1 ชุด",1,69700,"01.61.179",{"$f":"IF(BV11=\"จำหน่าย\",0,SUM(J11*K11))","v":69700},{"$f":"IF(K11<5000,0,M11)","v":69700},3,"2002-09-27",1096,23233.333333333332,1936.1111111111111,63.594890510948908,0,0,69699,0,69699,0,1,19,1,5,6975,"NO",null,null,null,null,null,null,null,null,null,null,null,null,null,null,null,33.333333333333336,null,null,null,null,null,null,null,null,null,null,null,null,null,null,null,null,null,null,null,null,null,null,"01","61","179",null,null,null,"19 ปี  1 เดือน  5 วัน  ",6]
[7,null,"2000-10-09",44,null,null,null,null,"ชุดควบคุมและค้นหาเส้นทางฯ 1 ชุด",1,99700,"01.61.184",{"$f":"IF(BV12=\"จำหน่าย\",0,SUM(J12*K12))","v":99700},{"$f":"IF(K12<5000,0,M12)","v":99700},3,"2003-10-09",1095,33233.333333333336,2769.4444444444448,91.050228310502277,0,0,99699,0,99699,0,1,18,0,23,6597,"NO",null,null,null,null,null,null,null,null,null,null,null,null,null,null,null,33.333333333333336,null,null,null,null,null,null,null,null,null,null,null,null,null,null,null,null,null,null,null,null,null,null,"01","61","184",null,null,null,"18 ปี  0 เดือน  23 วัน  ",7]
[8,null,"2000-10-26",44,null,null,null,null,"Classroom Control Network 30 U 1ชุด",1,99510,"01.61.190",{"$f":"IF(BV13=\"จำหน่าย\",0,SUM(J13*K13))","v":99510},{"$f":"IF(K13<5000,0,M13)","v":99510},3,"2003-10-26",1095,33170,2764.1666666666665,90.876712328767127,0,0,99509,0,99509,0,1,18,0,6,6580,"NO",null,null,null,null,null,null,null,null,null,null,null,null,null,null,null,33.333333333333336,null,null,null,null,null,null,null,null,null,null,null,null,null,null,null,null,null,null,null,null,null,null,"01","61","190",null,null,null,"18 ปี  0 เดือน  6 วัน  ",8]
[9,null,"2000-11-02",44,null,null,null,null,"โปรแกรมห้องสมุด 1 ชุด",1,1800000,"01.61.185",{"$f":"IF(BV14=\"จำหน่าย\",0,SUM(J14*K14))","v":1800000},{"$f":"IF(K14<5000,0,M14)","v":1800000},3,"2003-11-02",1095,600000,50000,1643.8356164383561,0,0,1799999,0,1799999,0,1,17,11,30,6573,"NO",null,null,null,null,null,null,null,null,null,null,null,null,null,null,null,33.333333333333336,null,null,null,null,null,null,null,null,null,null,null,null,null,null,null,null,null,null,null,null,null,null,"01","61","185",null,null,null,"17 ปี  11 เดือน  30 วัน  ",9]
[10,null,"2000-11-04",44,null,null,null,null,"แผงวงจรค้นหาเส้นทาง 1 แผง",1,39500,"01.61.186",{"$f":"IF(BV15=\"จำหน่าย\",0,SUM(J15*K15))","v":39500},{"$f":"IF(K15<5000,0,M15)","v":39500},3,"2003-11-04",1095,13166.666666666666,1097.2222222222222,36.073059360730596,0,0,39499,0,39499,0,1,17,11,28,6571,"NO",null,null,null,null,null,null,null,null,null,null,null,null,null,null,null,33.333333333333336,null,null,null,null,null,null,null,null,null,null,null,null,null,null,null,null,null,null,null,null,null,null,"01","61","186",null,null,null,"17 ปี  11 เดือน  28 วัน  ",10]
[11,null,"2001-01-24",44,null,null,null,null,"เครื่องถ่ายทอดสัญญาณ 1 ค.",1,118000,"01.61.191",{"$f":"IF(BV16=\"จำหน่าย\",0,SUM(J16*K16))","v":118000},{"$f":"IF(K16<5000,0,M16)","v":118000},3,"2004-01-24",1095,39333.333333333336,3277.7777777777778,107.76255707762557,0,0,117999,0,117999,0,1,17,9,8,6490,"NO",null,null,null,null,null,null,null,null,null,null,null,null,null,null,null,33.333333333333336,null,null,null,null,null,null,null,null,null,null,null,null,null,null,null,null,null,null,null,null,null,null,"01","61","191",null,null,null,"17 ปี  9 เดือน  8 วัน  ",11]
[12,null,"2001-06-21",44,null,null,null,null,"ชุดเชื่อมต่อคอมฯ 1 ชุด",1,918000,"01.61.188",{"$f":"IF(BV17=\"จำหน่าย\",0,SUM(J17*K17))","v":918000},{"$f":"IF(K17<5000,0,M17)","v":918000},3,"2004-06-21",1096,306000,25500,837.59124087591238,0,0,917999,0,917999,0,1,17,4,11,6342,"NO",null,null,null,null,null,null,null,null,null,null,null,null,null,null,null,33.333333333333336,null,null,null,null,null,null,null,null,null,null,null,null,null,null,null,null,null,null,null,null,null,null,"01","61","188",null,null,null,"17 ปี  4 เดือน  11 วัน  ",12]
[13,null,"2003-01-30",46,null,null,null,null,"ฐานข้อมูลวิชาการ 8 ฐาน 1 รายการ",1,1799000,"01.61.193",{"$f":"IF(BV18=\"จำหน่าย\",0,SUM(J18*K18))","v":1799000},{"$f":"IF(K18<5000,0,M18)","v":1799000},3,"2006-01-30",1096,599666.66666666663,49972.222222222219,1641.4233576642337,0,0,1798999,0,1798999,0,1,15,9,2,5754,"NO",null,null,null,null,null,null,null,null,null,null,null,null,null,null,null,33.333333333333336,null,null,null,null,null,null,null,null,null,null,null,null,null,null,null,null,null,null,null,null,null,null,"01","61","193",null,null,null,"15 ปี  9 เดือน  2 วัน  ",13]
[14,null,"2003-09-12",46,null,null,null,null,"ชุดทดลองการเชื่อมต่อ 2 ชุด ",2,17000,"01.61.194-195",{"$f":"IF(BV19=\"จำหน่าย\",0,SUM(J19*K19))","v":34000},{"$f":"IF(K19<5000,0,M19)","v":34000},3,"2006-09-12",1096,11333.333333333334,944.44444444444446,31.021897810218977,0,0,33998,0,33998,0,2,15,1,20,5529,"NO",null,null,null,null,null,null,null,null,null,null,null,null,null,null,null,33.333333333333336,null,null,null,null,null,null,null,null,null,null,null,null,null,null,null,null,null,null,null,null,null,null,"01","61","194-195",null,null,null,"15 ปี  1 เดือน  20 วัน  ",14]
[15,null,"2003-09-12",46,null,null,null,null,"ชุดทดลองการเชื่อมต่อ 2 ชุด ",2,17000,"01.61.197-198",{"$f":"IF(BV20=\"จำหน่าย\",0,SUM(J20*K20))","v":34000},{"$f":"IF(K20<5000,0,M20)","v":34000},3,"2006-09-12",1096,11333.333333333334,944.44444444444446,31.021897810218977,0,0,33998,0,33998,0,2,15,1,20,5529,"NO",null,null,null,null,null,null,null,null,null,null,null,null,null,null,null,33.333333333333336,null,null,null,null,null,null,null,null,null,null,null,null,null,null,null,null,null,null,null,null,null,null,"01","61","197-198",null,null,null,"15 ปี  1 เดือน  20 วัน  ",15]
{"$rows_left_out":83}
{"sheet":"report1","index":2,"n_rows":28,"n_cols":9,"rows_kept":28,"cut":false,"hidden":false,"merged":[[1,0,1,5],[0,0,0,4]]}
[" มหาวิทยาลัยราชภัฏราชนครินทร์ (สินทรัพย์ไม่มีตัวตน)",null,null,null,null,"ข้อมูล ณ วันที่",{"$f":"TODAY()","v":"2018-10-31"}]
[" บัญชีรายการค่าเสื่อมราคาและค่าเสื่อมราคาสะสม สินทรัพย์ไม่มีตัวตน ประจำเดือน ตุลาคม ปีงบประมาณ 2562"]
[null,"ปีงบประมาณ","ราคาทุน ที่คิดค่าเสื่อม","ค่าเสื่อมราคาเดือนปัจจุบัน","ค่าเสื่อมราคาสะสม","ผลรวม ของ มูลค่าสุทธิ   "]
[null,40,1134630,0,1134628,2]
[null,41,97900,0,97899,1]
[null,42,258180,0,258177,3]
[null,44,3074710,0,3074704,6]
[null,46,3467000,0,3466994,6,null,null," "]
[null,47,94131.88,0,94129.88,2]
[null,48,1061967.8500000001,0,1061961.8500000001,6]
[null,49,14296100,0,14296096,4,null,null," "]
[null,50,669729.11,0,669726.11,3]
[null,51,7921340.0800000001,0,7921312.0800000001,28,null," "]
[null,52,13019893.5,0,13019869.5,24,null,null," "]
[null,53,570000,0,569999,1]
[null,54,3828820,0,3828816,4]
[null,55,1072662,0,1072660,2,null," "]
[null,56,5501119,0,5501101,18,null," "]
[null,57,52999.99,0,52998.99,1,null," "]
[null,58,2314624,0,2314616,8]
{"$rows_left_out":9}
{"sheet":"report2","index":3,"n_rows":9,"n_cols":3,"rows_kept":9,"cut":false,"hidden":false,"merged":[[1,0,1,4]]}
[]
["รายงานหน่วยงานที่รับผิดชอบ"]
[]
["หน่วยงาน","หน่วยตรวจสอบภายใน"]
["สาขา","(ทั้งหมด)"]
[]
["ปีงบประมาณ","จำนวน ","ผลรวมราคาทุนรวม"]
[61,1,19800]
["ผลรวมทั้งหมด",1,19800]

{"sheet":"report3","index":4,"n_rows":9,"n_cols":3,"rows_kept":9,"cut":false,"hidden":false,"merged":[[1,1,1,4]]}
[]
[null,"รายงานผู้เบิก"]
[]
["หน่วยงาน","หน่วยตรวจสอบภายใน"]
["ผู้เบิก","(ทั้งหมด)"]
[]
["ปีงบประมาณ","จำนวน ","ผลรวมราคาทุนรวม"]
[61,1,19800]
["ผลรวมทั้งหมด",1,19800]

{"sheet":"report4","index":5,"n_rows":9,"n_cols":3,"rows_kept":9,"cut":false,"hidden":false,"merged":[[1,1,1,3]]}
[]
[null,"รายงานครุภัณฑ์"]
[]
["หมวด","(หลายรายการ)"]
["ประเภท","61"]
["หมายเลข","(ทั้งหมด)"]
[]
["ปีงบประมาณ","จำนวน ","ผลรวม มูลค่าสุทธิ   "]
["ผลรวมทั้งหมด"]

{"sheet":"ทะเบียนคุมทรัพย์สิน","index":6,"n_rows":32,"n_cols":14,"rows_kept":32,"cut":false,"hidden":false,"merged":[[12,2,12,4],[31,2,31,5],[28,2,28,5],[32,7,32,8],[0,0,0,14],[24,12,24,14],[25,12,25,14],[26,12,26,14],[27,12,27,14],[24,7,24,8],[25,7,25,8],[26,7,26,8],[27,7,27,8],[2,12,2,14],[6,8,6,14],[8,5,8,6],[32,12,32,14],[28,12,28,14],[29,12,29,14],[30,12,30,14],[31,12,31,14],[14,2,14,4],[15,2,15,4],[22,7,22,8],[22,2,22,4],[27,2,27,5],[25,2,25,5],[26,2,26,5],[24,2,24,5],[6,3,6,6],[8,2,8,3],[9,2,9,3],[32,9,32,11],[31,9,31,11],[27,9,27,11],[28,9,28,11],[29,9,29,11],[30,9,30,11],[32,2,32,5],[30,7,30,8],[31,7,31,8],[29,2,29,5],[28,7,28,8],[29,7,29,8],[30,2,30,5],[8,9,8,10],[9,12,9,14],[19,13,19,14],[26,9,26,11],[25,9,25,11],[24,9,24,11],[20,13,20,14],[16,13,16,14],[4,7,4,9],[3,7,3,9],[3,1,3,4],[4,1,4,4],[5,2,5,14],[3,12,3,14],[8,7,8,8],[1,8,1,14],[18,2,18,4],[19,2,19,4],[20,2,20,4],[17,13,17,14],[18,13,18,14],[16,2,16,4],[17,2,17,4],[7,1,7,14],[12,13,12,14],[13,13,13,14],[14,13,14,14],[15,13,15,14],[9,9,9,10],[13,2,13,4]]}
["ทะเบียนคุมทรัพย์สิน"]
[null,null,null,null,null,null,null,null,"ส่วนราชการ มหาวิทยาลัยราชภัฏราชนครินทร์"]
[null,null,null,null,null," ",null,null," ",null,null,"หน่วยงาน","หน่วยงาน"]
["ประเภท","ปรถเภท",null,null,null,"ลักษณะ/คุณสมบัติ",null,"ลักษณะ/คุณสมบัติ",null,null,null,"สาขา","สาขา"]
["รหัส","02.01.10",null,null,null,"รุ่น/แบบ/ขนาด",null,"รุ่น/แบบ/ขนาด"]
["หมายเลขเครื่อง",null,"หมายเลขเครื่อง"]
["สถานที่ตั้ง/หน่วยงานที่รับผิดชอบ",null,null,"หน่วยงาน",null,null,null,"ชื่อผู้ขาย","บริษัท/ร้านค้า"]
["ที่อยู่","ที่อยู่ผู้ขาย"]
["ประเภทเงิน",null,"ประเภท",null,"วิธีการได้มา","วิธีการที่ได้มา",null,"ชื่อผู้รับของ/ผู้รับผิดชอบ",null,"ผู้เบิก"]
["เอกสารอ้างอิง",null,"เอกสารอ้างอิง",null,"ใบเสร็จเล่มที่","ใบเสร็จเล่มที่","ใบเสร็จเลขที่","ใบเสร็จเลขที่","สัญญาเลขที่","สัญญาเลขที่",null,"เลขที่ใบเบิก","เลขที่ใบเบิกพัสดุ"]
[null,null,null,null,null,null,null,null," ","เล่ม","คุมเล่ม","คุมหน้า"]
[]
["วันที่ เดือน ปี","ที่เอกสาร","รายการ",null,null,"จำนวน","    ราคา     ต่อหน่วย","มูลค่ารวม","อายุการใช้งาน","อัตราค่าเสื่อมราคา %","ค่าเสื่อมราคาประจำปี","ค่าเสื่อมราคาสะสม","มูลค่าสุทธิ","หมายเหตุ"]
["2018-07-15","อกสาร","รถยนต์เก๋ง 4 ประตู 1 คัน",null,null,1,1190000,1190000,1,100,1190000,16301.369863013701,1173698.63013699,"หมายเหตุ"]
[]
[]
[]
[]
[]
[]
{"$rows_left_out":13}
{"sheet":" Search","index":7,"n_rows":22,"n_cols":7,"rows_kept":22,"cut":false,"hidden":false,"merged":[[0,4,0,5],[10,4,10,5],[11,4,11,5],[12,4,12,5],[1,0,1,1],[8,4,8,5],[9,4,9,5],[1,4,1,5],[3,4,3,5],[5,4,5,5],[6,4,6,5],[7,4,7,5],[4,4,4,5],[3,1,3,2],[2,0,2,6]]}
[null,null,null,null,"ข้อมูล ณ วันที่ :",null,{"$f":"TODAY()","v":"2018-10-31"}]
["ค้นหาครุภัณฑ์รายตัว",null,null,null," ",null," "]
["โปรดระบุหมายเลขครุภัณฑ์ที่ต้องการทราบรายละเอียด ในช่อง \"เลขครุภัณฑ์\""]
["เลขครุภัณฑ์ :","01.61.324",null,null,"ลำดับการบันทึก :",null,{"$f":"VLOOKUP(B4,'40-now'!L:BZ,67,FALSE)","v":95}]
["รายการ :",{"$f":"VLOOKUP(G4,'40-now'!A:BZ,9,FALSE)","v":"ระบบฐานข้อมูลตรวจสอบภายใน 1 ระบบ"},null,null,"วันที่บันทึก :",null,{"$f":"VLOOKUP(G4,'40-now'!A:BZ,76,FALSE)","v":0}]
["วันที่ได้มา :",{"$f":"VLOOKUP(G4,'40-now'!A:BZ,3,FALSE)","v":"2018-02-13"},null,null,"ปีงบประมาณ :",null,{"$f":"VLOOKUP(G4,'40-now'!A:BZ,4,FALSE)","v":61}]
["จำนวน :",{"$f":"VLOOKUP(G4,'40-now'!A:BZ,10,FALSE)","v":1},null,null,"วิธีการได้มา :",null,{"$f":"VLOOKUP(G4,'40-now'!A:BZ,5,FALSE)","v":"ตกลงราคา"}]
["ราคาต่อหน่วย :",{"$f":"VLOOKUP(G4,'40-now'!A:BZ,11,FALSE)","v":19800}," บาท",null,"ประเภทงบประมาณ :",null,{"$f":"VLOOKUP(G4,'40-now'!A:BZ,6,FALSE)","v":"รายได้"}]
["ราคารวม :",{"$f":"VLOOKUP(G4,'40-now'!A:BZ,13,FALSE)","v":19800}," บาท",null,"ทะเบียนคุมเล่มที่ :",null,{"$f":"VLOOKUP(G4,'40-now'!A:BZ,33,FALSE)","v":"7"}]
["อายุการใช้งาน :",{"$f":"VLOOKUP(G4,'40-now'!A:BZ,15,FALSE)","v":3}," ปี",null,"ทะเบียนคุมหน้าที่ :",null,{"$f":"VLOOKUP(G4,'40-now'!A:BZ,34,FALSE)","v":"136"}]
["ใช้งานมาแล้ว :",{"$f":"VLOOKUP(G4,'40-now'!A:BZ,77,FALSE)","v":"0 ปี  8 เดือน  19 วัน  "},null,null,"หน่วยงาน :",null,{"$f":"VLOOKUP(G4,'40-now'!A:BZ,35,FALSE)","v":"หน่วยตรวจสอบภายใน"}]
["ค่าเสื่อมราค่าต่อวัน :",{"$f":"VLOOKUP(G4,'40-now'!A:BZ,20,FALSE)","v":18.065693430656935}," บาท",null,"สาขา :",null,{"$f":"VLOOKUP(G4,'40-now'!A:BZ,36,FALSE)","v":"-"}]
["ค่าเสื่อมราคาสะสม :",{"$f":"VLOOKUP(G4,'40-now'!A:BZ,25,FALSE)","v":4715.1459854014602}," บาท",null,"ผู้เบิก :",null,{"$f":"VLOOKUP(G4,'40-now'!A:BZ,37,FALSE)","v":"นางสาวอรณัฐ ผาแก้ว"}]
["มูลค่าสุทธิ :",{"$f":"VLOOKUP(G4,'40-now'!A:BZ,27,FALSE)","v":15084.854014598539}," บาท",null," "]
[null,null,null,null," "]
[null,null,null,null," "]
[null,null,null,null," ",null," "]
[null,null,null,null," ",null," "]
[null,null,null,null," "]
[null,null,null,null," "]
{"$rows_left_out":3}
{"sheet":"Sheet2","index":8,"n_rows":12,"n_cols":21,"rows_kept":12,"cut":false,"hidden":true,"merged":[]}
[]
[null,null,null,null,null,null,{"$f":"IF(U2=0,0,IF(OR(DAY(C2)=1,MONTH(C2)<>MONTH(TODAY()),YEAR(C2)<>YEAR(TODAY())),T2*((DAY(DATE(YEAR(C2),MONTH(C2)+1,1)-1))),T2*((DAY(DATE(YEAR(C2),MONTH(C2)+1,1)-1)-DAY(C2)+1))))","v":0}]
[null,null,{"$f":"IF(U6=0,0,IF(DAY(C6)=1,T6*(DAY(DATE(YEAR(C6),MONTH(C6)+1,1)-1)),T6*(DAY(DATE(YEAR(C6),MONTH(C6)+1,1)-1)-DAY(C6)+1)))","v":24},null,null,null,0]
[null,null,{"$f":"IF(U6=0,0,IF(OR(DAY(C6)=1,MONTH(C6)<>MONTH(TODAY()),YEAR(C6)<>YEAR(TODAY())),(DAY(DATE(YEAR(C6),MONTH(C6)+1,1)-1)),(DAY(DATE(YEAR(C6),MONTH(C6)+1,1)-1)-DAY(C6)+1)))","v":31},{"$f":"IF(DAY(C6)=1&(MONTH(C6)<>MONTH(TODAY()))&(YEAR(C6)<>YEAR(TODAY())),(DAY(DATE(YEAR(C6),MONTH(C6)+1,1)-1)),(DAY(DATE(YEAR(C6),MONTH(C6)+1,1)-1)-DAY(C6)+1))","v":12},{"$f":"IF(DAY(C3)<=15,DATEDIF(C3,TODAY(),\"YM\")+1,IF(DAY(C3)=31,DATEDIF(C3,TODAY(),\"YM\")+1,IF(DAY(C3)=30,DATEDIF(C3,TODAY(),\"YM\")+1,IF(DAY(C3)=29,DATEDIF(C3,TODAY(),\"YM\")+1,DATEDIF(C3,TODAY(),\"YM\")))))","v":9},null,0,null,null,null,null,null,null,null,null,null,null,null,null,null,1]
[null,null,{"$f":"IF(U6=0,0,IF(DAY(C6)=1,(DAY(DATE(YEAR(C6),MONTH(C6)+1,1)-1)),(DAY(DATE(YEAR(C6),MONTH(C6)+1,1)-1)-DAY(C6)+1)))","v":12},null,null,null,0,null,null,null,null,null,null,null,null,null,null,null,null,null,0]
[null,null,"2017-08-20",null,null,null,{"$f":"IF(U6=0,0,IF(OR(DAY(C6)=1,MONTH(C6)<>MONTH(TODAY()),YEAR(C6)<>YEAR(TODAY())),((DAY(DATE(YEAR(TODAY()),MONTH(TODAY())+1,1)-1))),((DAY(DATE(YEAR(TODAY()),MONTH(TODAY())+1,1)-1)-DAY(C6)+1))))","v":31},null,null,null,null,null,null,null,null,null,null,null,null,2,1]
[null,null,null,null,null,null,{"$f":"IF(U6=0,0,IF(OR(DAY(C6)=1,MONTH(C6)<>MONTH(TODAY()),YEAR(C6)<>YEAR(TODAY())),((DAY(DATE(YEAR(C6),MONTH(C6)+1,1)-1))),((DAY(DATE(YEAR(C6),MONTH(C6)+1,1)-1)-DAY(C6)+1))))","v":31}]
[null,null,null,null,null,null,{"$f":"(DAY(DATE(YEAR(TODAY()),MONTH(TODAY())+1,1)-1))","v":31}]
[]
[]
[]
[null,null,null,null,null,null,null," "]